{"text_format":"3","workbook":"xlsx","n_sheets":4,"sheets":["Front Page","Page 2","Page 3","Codes"],"not_rendered":{"images":3,"defined_names":9},"read":"whole","date_system":"1900"}

{"sheet":"Front Page","index":0,"n_rows":45,"n_cols":18,"rows_kept":45,"merged":[[1,15,1,16],[2,2,2,4],[2,15,2,16],[3,2,3,4],[3,7,3,8],[3,15,3,16],[4,2,4,4],[4,7,4,8],[4,15,4,16],[7,0,7,1],[7,8,7,9],[7,12,7,13],[7,14,7,15],[7,16,7,17],[8,0,9,0],[8,1,9,1],[8,2,9,2],[8,3,9,3],[8,4,9,4],[8,5,9,5],[8,6,9,6],[8,7,9,7],[8,8,8,9],[8,10,9,10],[8,11,9,11],[8,12,9,13],[8,14,9,15],[8,16,9,17],[9,8,9,9],[10,0,11,0],[10,1,11,1],[10,2,11,2],[10,3,11,3],[10,4,11,4],[10,5,11,5],[10,6,11,6],[10,7,11,7],[10,8,10,9],[10,10,11,10],[10,11,11,11],[10,12,11,13],[10,14,11,15],[10,16,11,17],[11,8,11,9],[12,0,13,0],[12,1,13,1],[12,2,13,2],[12,3,13,3],[12,4,13,4],[12,5,13,5],[12,6,13,6],[12,7,13,7],[12,8,12,9],[12,10,13,10],[12,11,13,11],[12,12,13,13],[12,14,13,15],[12,16,13,17],[13,8,13,9],[14,0,15,0],[14,1,15,1],[14,2,15,2],[14,3,15,3],[14,4,15,4],[14,5,15,5],[14,6,15,6],[14,7,15,7],[14,8,14,9],[14,10,15,10],[14,11,15,11],[14,12,15,13],[14,14,15,15],[14,16,15,17],[15,8,15,9],[16,0,17,0],[16,1,17,1],[16,2,17,2],[16,3,17,3],[16,4,17,4],[16,5,17,5],[16,6,17,6],[16,7,17,7],[16,8,16,9],[16,10,17,10],[16,11,17,11],[16,12,17,13],[16,14,17,15],[16,16,17,17],[17,8,17,9],[18,0,19,0],[18,1,19,1],[18,2,19,2],[18,3,19,3],[18,4,19,4],[18,5,19,5],[18,6,19,6],[18,7,19,7],[18,8,18,9],[18,10,19,10],[18,11,19,11],[18,12,19,13],[18,14,19,15],[18,16,19,17],[19,8,19,9],[20,0,21,0],[20,1,21,1],[20,2,21,2],[20,3,21,3],[20,4,21,4],[20,5,21,5],[20,6,21,6],[20,7,21,7],[20,8,20,9],[20,10,21,10],[20,11,21,11],[20,12,21,13],[20,14,21,15],[20,16,21,17],[21,8,21,9],[22,0,23,0],[22,1,23,1],[22,2,23,2],[22,3,23,3],[22,4,23,4],[22,5,23,5],[22,6,23,6],[22,7,23,7],[22,8,22,9],[22,10,23,10],[22,11,23,11],[22,12,23,13],[22,14,23,15],[22,16,23,17],[23,8,23,9],[24,0,25,0],[24,1,25,1],[24,2,25,2],[24,3,25,3],[24,4,25,4],[24,5,25,5],[24,6,25,6],[24,7,25,7],[24,8,24,9],[24,10,25,10],[24,11,25,11],[24,12,25,13],[24,14,25,15],[24,16,25,17],[25,8,25,9],[26,0,27,0],[26,1,27,1],[26,2,27,2],[26,3,27,3],[26,4,27,4],[26,5,27,5],[26,6,27,6],[26,7,27,7],[26,8,26,9],[26,10,27,10],[26,11,27,11],[26,12,27,13],[26,14,27,15],[26,16,27,17],[27,8,27,9],[28,0,29,0],[28,1,29,1],[28,2,29,2],[28,3,29,3],[28,4,29,4],[28,5,29,5],[28,6,29,6],[28,7,29,7],[28,8,28,9],[28,10,29,10],[28,11,29,11],[28,12,29,13],[28,14,29,15],[28,16,29,17],[29,8,29,9],[30,0,31,0],[30,1,31,1],[30,2,31,2],[30,3,31,3],[30,4,31,4],[30,5,31,5],[30,6,31,6],[30,7,31,7],[30,8,30,9],[30,10,31,10],[30,11,31,11],[30,12,31,13],[30,14,31,15],[30,16,31,17],[31,8,31,9],[32,0,33,0],[32,1,33,1],[32,2,33,2],[32,3,33,3],[32,4,33,4],[32,5,33,5],[32,6,33,6],[32,7,33,7],[32,8,32,9],[32,10,33,10],[32,11,33,11],[32,12,33,13],[32,14,33,15],[32,16,33,17],[33,8,33,9],[34,0,35,0],[34,1,35,1],[34,2,35,2],[34,3,35,3],[34,4,35,4],[34,5,35,5],[34,6,35,6],[34,7,35,7],[34,8,34,9],[34,10,35,10],[34,11,35,11],[34,12,35,13],[34,14,35,15],[34,16,35,17],[35,8,35,9],[36,0,37,0],[36,1,37,1],[36,2,37,2],[36,3,37,3],[36,4,37,4],[36,5,37,5],[36,6,37,6],[36,7,37,7],[36,8,36,9],[36,10,37,10],[36,11,37,11],[36,12,37,13],[36,14,37,15],[36,16,37,17],[37,8,37,9],[38,0,39,9],[38,12,39,15],[40,12,40,15],[42,0,42,4],[42,6,42,8],[42,10,42,13],[42,15,42,16],[43,0,43,4],[43,6,43,8],[43,10,43,13],[43,15,43,16]]}
["EXPENSE VOUCHER",{"$nulls":5},"     Out of State Travel",{"$nulls":4}," ACCOUNTS PAYABLE USE ONLY:"]
[{"$nulls":6},"Send Check To:",{"$nulls":4}," Vendor #",{"$f":"LOOKUP(C3,VNumber)","v":{"$error":"#N/A"}},null,"Comment:","Travel"]
["NAME",{"$nulls":5},"     Home",{"$nulls":4}," Invoice #",null,null,"Due Date:"]
["ADDRESS",{"$nulls":5},"     Office",{"$nulls":4}," Inv Date:",null,null,"Checked By:"]
[{"$nulls":7},"(specify)",{"$nulls":3}," Inv Total:",{"$f":"M39","v":"INVALID/MISSING NAME"},null,"Approved By:"]
[]
[]
["DEPARTURE  DATE    HOUR",null,"ARRIVAL HOUR","PROGRAM","QTS","LODGING EXPENSE","TOTAL PER DIEM","OTHER EXPENSES","ODOMETER",null,"TOTAL MILEAGE","TOTAL CHARGE","TRAVEL FROM",null,"TRAVEL TO",null,"TOTAL"]
[{"$nulls":6},{"$f":"E9*IF(Codes!$G$1=TRUE,14,9)+F9","v":0},{"$nulls":3},{"$f":"I10-I9","v":0},{"$f":"ROUND(K9*0.625,2)","v":0},{"$nulls":4},{"$f":"IF(AND(G9+H9+L9>0,ISBLANK(A9)=TRUE),\"Enter Date\",IF(AND(G9+H9+L9>0,ISBLANK(D9)=TRUE),\"Select Program\",G9+H9+L9))","v":0}]
[]
[{"$nulls":6},{"$f":"E11*IF(Codes!$G$1=TRUE,14,9)+F11","v":0},{"$nulls":3},{"$f":"I12-I11","v":0},{"$f":"ROUND(K11*0.625,2)","v":0},{"$nulls":4},{"$f":"IF(AND(G11+H11+L11>0,ISBLANK(A11)=TRUE),\"Enter Date\",IF(AND(G11+H11+L11>0,ISBLANK(D11)=TRUE),\"Select Program\",G11+H11+L11))","v":0}]
[]
[{"$nulls":6},{"$f":"E13*IF(Codes!$G$1=TRUE,14,9)+F13","v":0},{"$nulls":3},{"$f":"I14-I13","v":0},{"$f":"ROUND(K13*0.625,2)","v":0},{"$nulls":4},{"$f":"IF(AND(G13+H13+L13>0,ISBLANK(A13)=TRUE),\"Enter Date\",IF(AND(G13+H13+L13>0,ISBLANK(D13)=TRUE),\"Select Program\",G13+H13+L13))","v":0}]
[]
[{"$nulls":6},{"$f":"E15*IF(Codes!$G$1=TRUE,14,9)+F15","v":0},{"$nulls":3},{"$f":"I16-I15","v":0},{"$f":"ROUND(K15*0.625,2)","v":0},{"$nulls":4},{"$f":"IF(AND(G15+H15+L15>0,ISBLANK(A15)=TRUE),\"Enter Date\",IF(AND(G15+H15+L15>0,ISBLANK(D15)=TRUE),\"Select Program\",G15+H15+L15))","v":0}]
[]
[{"$nulls":6},{"$f":"E17*IF(Codes!$G$1=TRUE,14,9)+F17","v":0},{"$nulls":3},{"$f":"I18-I17","v":0},{"$f":"ROUND(K17*0.625,2)","v":0},{"$nulls":4},{"$f":"IF(AND(G17+H17+L17>0,ISBLANK(A17)=TRUE),\"Enter Date\",IF(AND(G17+H17+L17>0,ISBLANK(D17)=TRUE),\"Select Program\",G17+H17+L17))","v":0}]
[]
[{"$nulls":6},{"$f":"E19*IF(Codes!$G$1=TRUE,14,9)+F19","v":0},{"$nulls":3},{"$f":"I20-I19","v":0},{"$f":"ROUND(K19*0.625,2)","v":0},{"$nulls":4},{"$f":"IF(AND(G19+H19+L19>0,ISBLANK(A19)=TRUE),\"Enter Date\",IF(AND(G19+H19+L19>0,ISBLANK(D19)=TRUE),\"Select Program\",G19+H19+L19))","v":0}]
[]
[{"$nulls":6},{"$f":"E21*IF(Codes!$G$1=TRUE,14,9)+F21","v":0},{"$nulls":3},{"$f":"I22-I21","v":0},{"$f":"ROUND(K21*0.625,2)","v":0},{"$nulls":4},{"$f":"IF(AND(G21+H21+L21>0,ISBLANK(A21)=TRUE),\"Enter Date\",IF(AND(G21+H21+L21>0,ISBLANK(D21)=TRUE),\"Select Program\",G21+H21+L21))","v":0}]
[]
[{"$nulls":6},{"$f":"E23*IF(Codes!$G$1=TRUE,14,9)+F23","v":0},{"$nulls":3},{"$f":"I24-I23","v":0},{"$f":"ROUND(K23*0.625,2)","v":0},{"$nulls":4},{"$f":"IF(AND(G23+H23+L23>0,ISBLANK(A23)=TRUE),\"Enter Date\",IF(AND(G23+H23+L23>0,ISBLANK(D23)=TRUE),\"Select Program\",G23+H23+L23))","v":0}]
[]
[{"$nulls":6},{"$f":"E25*IF(Codes!$G$1=TRUE,14,9)+F25","v":0},{"$nulls":3},{"$f":"I26-I25","v":0},{"$f":"ROUND(K25*0.625,2)","v":0},{"$nulls":4},{"$f":"IF(AND(G25+H25+L25>0,ISBLANK(A25)=TRUE),\"Enter Date\",IF(AND(G25+H25+L25>0,ISBLANK(D25)=TRUE),\"Select Program\",G25+H25+L25))","v":0}]
[]
[{"$nulls":6},{"$f":"E27*IF(Codes!$G$1=TRUE,14,9)+F27","v":0},{"$nulls":3},{"$f":"I28-I27","v":0},{"$f":"ROUND(K27*0.625,2)","v":0},{"$nulls":4},{"$f":"IF(AND(G27+H27+L27>0,ISBLANK(A27)=TRUE),\"Enter Date\",IF(AND(G27+H27+L27>0,ISBLANK(D27)=TRUE),\"Select Program\",G27+H27+L27))","v":0}]
[]
[{"$nulls":6},{"$f":"E29*IF(Codes!$G$1=TRUE,14,9)+F29","v":0},{"$nulls":3},{"$f":"I30-I29","v":0},{"$f":"ROUND(K29*0.625,2)","v":0},{"$nulls":4},{"$f":"IF(AND(G29+H29+L29>0,ISBLANK(A29)=TRUE),\"Enter Date\",IF(AND(G29+H29+L29>0,ISBLANK(D29)=TRUE),\"Select Program\",G29+H29+L29))","v":0}]
[]
{"$rows_left_out":16}
{"sheet":"Page 2","index":1,"n_rows":44,"n_cols":17,"rows_kept":44,"merged":[[0,15,0,16],[1,15,1,16],[2,2,2,4],[2,15,2,16],[3,2,3,4],[3,7,3,8],[3,15,3,16],[4,2,4,4],[4,7,4,8],[4,15,4,16],[7,0,7,1],[7,8,7,9],[7,12,7,13],[7,14,7,15],[7,16,7,17],[8,0,9,0],[8,1,9,1],[8,2,9,2],[8,3,9,3],[8,4,9,4],[8,5,9,5],[8,6,9,6],[8,7,9,7],[8,8,8,9],[8,10,9,10],[8,11,9,11],[8,12,9,13],[8,14,9,15],[8,16,9,17],[9,8,9,9],[10,0,11,0],[10,1,11,1],[10,2,11,2],[10,3,11,3],[10,4,11,4],[10,5,11,5],[10,6,11,6],[10,7,11,7],[10,8,10,9],[10,10,11,10],[10,11,11,11],[10,12,11,13],[10,14,11,15],[10,16,11,17],[11,8,11,9],[12,0,13,0],[12,1,13,1],[12,2,13,2],[12,3,13,3],[12,4,13,4],[12,5,13,5],[12,6,13,6],[12,7,13,7],[12,8,12,9],[12,10,13,10],[12,11,13,11],[12,12,13,13],[12,14,13,15],[12,16,13,17],[13,8,13,9],[14,0,15,0],[14,1,15,1],[14,2,15,2],[14,3,15,3],[14,4,15,4],[14,5,15,5],[14,6,15,6],[14,7,15,7],[14,8,14,9],[14,10,15,10],[14,11,15,11],[14,12,15,13],[14,14,15,15],[14,16,15,17],[15,8,15,9],[16,0,17,0],[16,1,17,1],[16,2,17,2],[16,3,17,3],[16,4,17,4],[16,5,17,5],[16,6,17,6],[16,7,17,7],[16,8,16,9],[16,10,17,10],[16,11,17,11],[16,12,17,13],[16,14,17,15],[16,16,17,17],[17,8,17,9],[18,0,19,0],[18,1,19,1],[18,2,19,2],[18,3,19,3],[18,4,19,4],[18,5,19,5],[18,6,19,6],[18,7,19,7],[18,8,18,9],[18,10,19,10],[18,11,19,11],[18,12,19,13],[18,14,19,15],[18,16,19,17],[19,8,19,9],[20,0,21,0],[20,1,21,1],[20,2,21,2],[20,3,21,3],[20,4,21,4],[20,5,21,5],[20,6,21,6],[20,7,21,7],[20,8,20,9],[20,10,21,10],[20,11,21,11],[20,12,21,13],[20,14,21,15],[20,16,21,17],[21,8,21,9],[22,0,23,0],[22,1,23,1],[22,2,23,2],[22,3,23,3],[22,4,23,4],[22,5,23,5],[22,6,23,6],[22,7,23,7],[22,8,22,9],[22,10,23,10],[22,11,23,11],[22,12,23,13],[22,14,23,15],[22,16,23,17],[23,8,23,9],[24,0,25,0],[24,1,25,1],[24,2,25,2],[24,3,25,3],[24,4,25,4],[24,5,25,5],[24,6,25,6],[24,7,25,7],[24,8,24,9],[24,10,25,10],[24,11,25,11],[24,12,25,13],[24,14,25,15],[24,16,25,17],[25,8,25,9],[26,0,27,0],[26,1,27,1],[26,2,27,2],[26,3,27,3],[26,4,27,4],[26,5,27,5],[26,6,27,6],[26,7,27,7],[26,8,26,9],[26,10,27,10],[26,11,27,11],[26,12,27,13],[26,14,27,15],[26,16,27,17],[27,8,27,9],[28,0,29,0],[28,1,29,1],[28,2,29,2],[28,3,29,3],[28,4,29,4],[28,5,29,5],[28,6,29,6],[28,7,29,7],[28,8,28,9],[28,10,29,10],[28,11,29,11],[28,12,29,13],[28,14,29,15],[28,16,29,17],[29,8,29,9],[30,0,31,0],[30,1,31,1],[30,2,31,2],[30,3,31,3],[30,4,31,4],[30,5,31,5],[30,6,31,6],[30,7,31,7],[30,8,30,9],[30,10,31,10],[30,11,31,11],[30,12,31,13],[30,14,31,15],[30,16,31,17],[31,8,31,9],[32,0,33,0],[32,1,33,1],[32,2,33,2],[32,3,33,3],[32,4,33,4],[32,5,33,5],[32,6,33,6],[32,7,33,7],[32,8,32,9],[32,10,33,10],[32,11,33,11],[32,12,33,13],[32,14,33,15],[32,16,33,17],[33,8,33,9],[34,0,35,0],[34,1,35,1],[34,2,35,2],[34,3,35,3],[34,4,35,4],[34,5,35,5],[34,6,35,6],[34,7,35,7],[34,8,34,9],[34,10,35,10],[34,11,35,11],[34,12,35,13],[34,14,35,15],[34,16,35,17],[35,8,35,9],[36,0,37,0],[36,1,37,1],[36,2,37,2],[36,3,37,3],[36,4,37,4],[36,5,37,5],[36,6,37,6],[36,7,37,7],[36,8,36,9],[36,10,37,10],[36,11,37,11],[36,12,37,13],[36,14,37,15],[36,16,37,17],[37,8,37,9],[38,0,39,9],[38,12,39,15],[40,12,40,15],[42,0,42,4],[42,6,42,8],[42,10,42,13],[42,15,42,16],[43,0,43,4],[43,6,43,8],[43,10,43,13],[43,15,43,16]]}
["EXPENSE VOUCHER",{"$nulls":14},"PAGE 2"]
[]
["NAME",null,{"$f":"'Front Page'!C3:E3","v":0}]
["ADDRESS",null,{"$f":"'Front Page'!C4:E4","v":0}]
[null,null,{"$f":"'Front Page'!C5:E5","v":0}]
[]
[]
["DEPARTURE  DATE    HOUR",null,"ARRIVAL HOUR","PROGRAM","QTS","LODGING EXPENSE","TOTAL PER DIEM","OTHER EXPENSES","ODOMETER",null,"TOTAL MILEAGE","TOTAL CHARGE","TRAVEL FROM",null,"TRAVEL TO",null,"TOTAL"]
[{"$nulls":6},{"$f":"E9*IF(Codes!$G$1=TRUE,14,9)+F9","v":0},{"$nulls":3},{"$f":"I10-I9","v":0},{"$f":"ROUND(K9*0.585,2)","v":0},{"$nulls":4},{"$f":"IF(AND(G9+H9+L9>0,ISBLANK(A9)=TRUE),\"Enter Date\",IF(AND(G9+H9+L9>0,ISBLANK(D9)=TRUE),\"Select Program\",G9+H9+L9))","v":0}]
[]
[{"$nulls":6},{"$f":"E11*IF(Codes!$G$1=TRUE,14,9)+F11","v":0},{"$nulls":3},{"$f":"I12-I11","v":0},{"$f":"ROUND(K11*0.585,2)","v":0},{"$nulls":4},{"$f":"IF(AND(G11+H11+L11>0,ISBLANK(A11)=TRUE),\"Enter Date\",IF(AND(G11+H11+L11>0,ISBLANK(D11)=TRUE),\"Select Program\",G11+H11+L11))","v":0}]
[]
[{"$nulls":6},{"$f":"E13*IF(Codes!$G$1=TRUE,14,9)+F13","v":0},{"$nulls":3},{"$f":"I14-I13","v":0},{"$f":"ROUND(K13*0.585,2)","v":0},{"$nulls":4},{"$f":"IF(AND(G13+H13+L13>0,ISBLANK(A13)=TRUE),\"Enter Date\",IF(AND(G13+H13+L13>0,ISBLANK(D13)=TRUE),\"Select Program\",G13+H13+L13))","v":0}]
[]
[{"$nulls":6},{"$f":"E15*IF(Codes!$G$1=TRUE,14,9)+F15","v":0},{"$nulls":3},{"$f":"I16-I15","v":0},{"$f":"ROUND(K15*0.585,2)","v":0},{"$nulls":4},{"$f":"IF(AND(G15+H15+L15>0,ISBLANK(A15)=TRUE),\"Enter Date\",IF(AND(G15+H15+L15>0,ISBLANK(D15)=TRUE),\"Select Program\",G15+H15+L15))","v":0}]
[]
[{"$nulls":6},{"$f":"E17*IF(Codes!$G$1=TRUE,14,9)+F17","v":0},{"$nulls":3},{"$f":"I18-I17","v":0},{"$f":"ROUND(K17*0.625,2)","v":0},{"$nulls":4},{"$f":"IF(AND(G17+H17+L17>0,ISBLANK(A17)=TRUE),\"Enter Date\",IF(AND(G17+H17+L17>0,ISBLANK(D17)=TRUE),\"Select Program\",G17+H17+L17))","v":0}]
[]
[{"$nulls":6},{"$f":"E19*IF(Codes!$G$1=TRUE,14,9)+F19","v":0},{"$nulls":3},{"$f":"I20-I19","v":0},{"$f":"ROUND(K19*0.625,2)","v":0},{"$nulls":4},{"$f":"IF(AND(G19+H19+L19>0,ISBLANK(A19)=TRUE),\"Enter Date\",IF(AND(G19+H19+L19>0,ISBLANK(D19)=TRUE),\"Select Program\",G19+H19+L19))","v":0}]
[]
[{"$nulls":6},{"$f":"E21*IF(Codes!$G$1=TRUE,14,9)+F21","v":0},{"$nulls":3},{"$f":"I22-I21","v":0},{"$f":"ROUND(K21*0.625,2)","v":0},{"$nulls":4},{"$f":"IF(AND(G21+H21+L21>0,ISBLANK(A21)=TRUE),\"Enter Date\",IF(AND(G21+H21+L21>0,ISBLANK(D21)=TRUE),\"Select Program\",G21+H21+L21))","v":0}]
[]
[{"$nulls":6},{"$f":"E23*IF(Codes!$G$1=TRUE,14,9)+F23","v":0},{"$nulls":3},{"$f":"I24-I23","v":0},{"$f":"ROUND(K23*0.625,2)","v":0},{"$nulls":4},{"$f":"IF(AND(G23+H23+L23>0,ISBLANK(A23)=TRUE),\"Enter Date\",IF(AND(G23+H23+L23>0,ISBLANK(D23)=TRUE),\"Select Program\",G23+H23+L23))","v":0}]
[]
[{"$nulls":6},{"$f":"E25*IF(Codes!$G$1=TRUE,14,9)+F25","v":0},{"$nulls":3},{"$f":"I26-I25","v":0},{"$f":"ROUND(K25*0.625,2)","v":0},{"$nulls":4},{"$f":"IF(AND(G25+H25+L25>0,ISBLANK(A25)=TRUE),\"Enter Date\",IF(AND(G25+H25+L25>0,ISBLANK(D25)=TRUE),\"Select Program\",G25+H25+L25))","v":0}]
[]
[{"$nulls":6},{"$f":"E27*IF(Codes!$G$1=TRUE,14,9)+F27","v":0},{"$nulls":3},{"$f":"I28-I27","v":0},{"$f":"ROUND(K27*0.625,2)","v":0},{"$nulls":4},{"$f":"IF(AND(G27+H27+L27>0,ISBLANK(A27)=TRUE),\"Enter Date\",IF(AND(G27+H27+L27>0,ISBLANK(D27)=TRUE),\"Select Program\",G27+H27+L27))","v":0}]
[]
[{"$nulls":6},{"$f":"E29*IF(Codes!$G$1=TRUE,14,9)+F29","v":0},{"$nulls":3},{"$f":"I30-I29","v":0},{"$f":"ROUND(K29*0.625,2)","v":0},{"$nulls":4},{"$f":"IF(AND(G29+H29+L29>0,ISBLANK(A29)=TRUE),\"Enter Date\",IF(AND(G29+H29+L29>0,ISBLANK(D29)=TRUE),\"Select Program\",G29+H29+L29))","v":0}]
[]
{"$rows_left_out":15}
{"sheet":"Page 3","index":2,"n_rows":44,"n_cols":17,"rows_kept":44,"merged":[[0,15,0,16],[1,15,1,16],[2,2,2,4],[2,15,2,16],[3,2,3,4],[3,7,3,8],[3,15,3,16],[4,2,4,4],[4,7,4,8],[4,15,4,16],[7,0,7,1],[7,8,7,9],[7,12,7,13],[7,14,7,15],[7,16,7,17],[8,0,9,0],[8,1,9,1],[8,2,9,2],[8,3,9,3],[8,4,9,4],[8,5,9,5],[8,6,9,6],[8,7,9,7],[8,8,8,9],[8,10,9,10],[8,11,9,11],[8,12,9,13],[8,14,9,15],[8,16,9,17],[9,8,9,9],[10,0,11,0],[10,1,11,1],[10,2,11,2],[10,3,11,3],[10,4,11,4],[10,5,11,5],[10,6,11,6],[10,7,11,7],[10,8,10,9],[10,10,11,10],[10,11,11,11],[10,12,11,13],[10,14,11,15],[10,16,11,17],[11,8,11,9],[12,0,13,0],[12,1,13,1],[12,2,13,2],[12,3,13,3],[12,4,13,4],[12,5,13,5],[12,6,13,6],[12,7,13,7],[12,8,12,9],[12,10,13,10],[12,11,13,11],[12,12,13,13],[12,14,13,15],[12,16,13,17],[13,8,13,9],[14,0,15,0],[14,1,15,1],[14,2,15,2],[14,3,15,3],[14,4,15,4],[14,5,15,5],[14,6,15,6],[14,7,15,7],[14,8,14,9],[14,10,15,10],[14,11,15,11],[14,12,15,13],[14,14,15,15],[14,16,15,17],[15,8,15,9],[16,0,17,0],[16,1,17,1],[16,2,17,2],[16,3,17,3],[16,4,17,4],[16,5,17,5],[16,6,17,6],[16,7,17,7],[16,8,16,9],[16,10,17,10],[16,11,17,11],[16,12,17,13],[16,14,17,15],[16,16,17,17],[17,8,17,9],[18,0,19,0],[18,1,19,1],[18,2,19,2],[18,3,19,3],[18,4,19,4],[18,5,19,5],[18,6,19,6],[18,7,19,7],[18,8,18,9],[18,10,19,10],[18,11,19,11],[18,12,19,13],[18,14,19,15],[18,16,19,17],[19,8,19,9],[20,0,21,0],[20,1,21,1],[20,2,21,2],[20,3,21,3],[20,4,21,4],[20,5,21,5],[20,6,21,6],[20,7,21,7],[20,8,20,9],[20,10,21,10],[20,11,21,11],[20,12,21,13],[20,14,21,15],[20,16,21,17],[21,8,21,9],[22,0,23,0],[22,1,23,1],[22,2,23,2],[22,3,23,3],[22,4,23,4],[22,5,23,5],[22,6,23,6],[22,7,23,7],[22,8,22,9],[22,10,23,10],[22,11,23,11],[22,12,23,13],[22,14,23,15],[22,16,23,17],[23,8,23,9],[24,0,25,0],[24,1,25,1],[24,2,25,2],[24,3,25,3],[24,4,25,4],[24,5,25,5],[24,6,25,6],[24,7,25,7],[24,8,24,9],[24,10,25,10],[24,11,25,11],[24,12,25,13],[24,14,25,15],[24,16,25,17],[25,8,25,9],[26,0,27,0],[26,1,27,1],[26,2,27,2],[26,3,27,3],[26,4,27,4],[26,5,27,5],[26,6,27,6],[26,7,27,7],[26,8,26,9],[26,10,27,10],[26,11,27,11],[26,12,27,13],[26,14,27,15],[26,16,27,17],[27,8,27,9],[28,0,29,0],[28,1,29,1],[28,2,29,2],[28,3,29,3],[28,4,29,4],[28,5,29,5],[28,6,29,6],[28,7,29,7],[28,8,28,9],[28,10,29,10],[28,11,29,11],[28,12,29,13],[28,14,29,15],[28,16,29,17],[29,8,29,9],[30,0,31,0],[30,1,31,1],[30,2,31,2],[30,3,31,3],[30,4,31,4],[30,5,31,5],[30,6,31,6],[30,7,31,7],[30,8,30,9],[30,10,31,10],[30,11,31,11],[30,12,31,13],[30,14,31,15],[30,16,31,17],[31,8,31,9],[32,0,33,0],[32,1,33,1],[32,2,33,2],[32,3,33,3],[32,4,33,4],[32,5,33,5],[32,6,33,6],[32,7,33,7],[32,8,32,9],[32,10,33,10],[32,11,33,11],[32,12,33,13],[32,14,33,15],[32,16,33,17],[33,8,33,9],[34,0,35,0],[34,1,35,1],[34,2,35,2],[34,3,35,3],[34,4,35,4],[34,5,35,5],[34,6,35,6],[34,7,35,7],[34,8,34,9],[34,10,35,10],[34,11,35,11],[34,12,35,13],[34,14,35,15],[34,16,35,17],[35,8,35,9],[36,0,37,0],[36,1,37,1],[36,2,37,2],[36,3,37,3],[36,4,37,4],[36,5,37,5],[36,6,37,6],[36,7,37,7],[36,8,36,9],[36,10,37,10],[36,11,37,11],[36,12,37,13],[36,14,37,15],[36,16,37,17],[37,8,37,9],[38,0,39,9],[38,12,39,15],[40,12,40,15],[42,0,42,4],[42,6,42,8],[42,10,42,13],[42,15,42,16],[43,0,43,4],[43,6,43,8],[43,10,43,13],[43,15,43,16]]}
["EXPENSE VOUCHER",{"$nulls":14},"PAGE 3"]
[]
["NAME",null,{"$f":"'Front Page'!C3:E3","v":0}]
["ADDRESS",null,{"$f":"'Front Page'!C4:E4","v":0}]
[null,null,{"$f":"'Front Page'!C5:E5","v":0}]
[]
[]
["DEPARTURE  DATE    HOUR",null,"ARRIVAL HOUR","PROGRAM","QTS","LODGING EXPENSE","TOTAL PER DIEM","OTHER EXPENSES","ODOMETER",null,"TOTAL MILEAGE","TOTAL CHARGE","TRAVEL FROM",null,"TRAVEL TO",null,"TOTAL"]
[{"$nulls":6},{"$f":"E9*IF(Codes!$G$1=TRUE,14,9)+F9","v":0},{"$nulls":3},{"$f":"I10-I9","v":0},{"$f":"ROUND(K9*0.585,2)","v":0},{"$nulls":4},{"$f":"IF(AND(G9+H9+L9>0,ISBLANK(A9)=TRUE),\"Enter Date\",IF(AND(G9+H9+L9>0,ISBLANK(D9)=TRUE),\"Select Program\",G9+H9+L9))","v":0}]
[]
[{"$nulls":6},{"$f":"E11*IF(Codes!$G$1=TRUE,14,9)+F11","v":0},{"$nulls":3},{"$f":"I12-I11","v":0},{"$f":"ROUND(K11*0.585,2)","v":0},{"$nulls":4},{"$f":"IF(AND(G11+H11+L11>0,ISBLANK(A11)=TRUE),\"Enter Date\",IF(AND(G11+H11+L11>0,ISBLANK(D11)=TRUE),\"Select Program\",G11+H11+L11))","v":0}]
[]
[{"$nulls":6},{"$f":"E13*IF(Codes!$G$1=TRUE,14,9)+F13","v":0},{"$nulls":3},{"$f":"I14-I13","v":0},{"$f":"ROUND(K13*0.585,2)","v":0},{"$nulls":4},{"$f":"IF(AND(G13+H13+L13>0,ISBLANK(A13)=TRUE),\"Enter Date\",IF(AND(G13+H13+L13>0,ISBLANK(D13)=TRUE),\"Select Program\",G13+H13+L13))","v":0}]
[]
[{"$nulls":6},{"$f":"E15*IF(Codes!$G$1=TRUE,14,9)+F15","v":0},{"$nulls":3},{"$f":"I16-I15","v":0},{"$f":"ROUND(K15*0.585,2)","v":0},{"$nulls":4},{"$f":"IF(AND(G15+H15+L15>0,ISBLANK(A15)=TRUE),\"Enter Date\",IF(AND(G15+H15+L15>0,ISBLANK(D15)=TRUE),\"Select Program\",G15+H15+L15))","v":0}]
[]
[{"$nulls":6},{"$f":"E17*IF(Codes!$G$1=TRUE,14,9)+F17","v":0},{"$nulls":3},{"$f":"I18-I17","v":0},{"$f":"ROUND(K17*0.625,2)","v":0},{"$nulls":4},{"$f":"IF(AND(G17+H17+L17>0,ISBLANK(A17)=TRUE),\"Enter Date\",IF(AND(G17+H17+L17>0,ISBLANK(D17)=TRUE),\"Select Program\",G17+H17+L17))","v":0}]
[]
[{"$nulls":6},{"$f":"E19*IF(Codes!$G$1=TRUE,14,9)+F19","v":0},{"$nulls":3},{"$f":"I20-I19","v":0},{"$f":"ROUND(K19*0.625,2)","v":0},{"$nulls":4},{"$f":"IF(AND(G19+H19+L19>0,ISBLANK(A19)=TRUE),\"Enter Date\",IF(AND(G19+H19+L19>0,ISBLANK(D19)=TRUE),\"Select Program\",G19+H19+L19))","v":0}]
[]
[{"$nulls":6},{"$f":"E21*IF(Codes!$G$1=TRUE,14,9)+F21","v":0},{"$nulls":3},{"$f":"I22-I21","v":0},{"$f":"ROUND(K21*0.625,2)","v":0},{"$nulls":4},{"$f":"IF(AND(G21+H21+L21>0,ISBLANK(A21)=TRUE),\"Enter Date\",IF(AND(G21+H21+L21>0,ISBLANK(D21)=TRUE),\"Select Program\",G21+H21+L21))","v":0}]
[]
[{"$nulls":6},{"$f":"E23*IF(Codes!$G$1=TRUE,14,9)+F23","v":0},{"$nulls":3},{"$f":"I24-I23","v":0},{"$f":"ROUND(K23*0.625,2)","v":0},{"$nulls":4},{"$f":"IF(AND(G23+H23+L23>0,ISBLANK(A23)=TRUE),\"Enter Date\",IF(AND(G23+H23+L23>0,ISBLANK(D23)=TRUE),\"Select Program\",G23+H23+L23))","v":0}]
[]
[{"$nulls":6},{"$f":"E25*IF(Codes!$G$1=TRUE,14,9)+F25","v":0},{"$nulls":3},{"$f":"I26-I25","v":0},{"$f":"ROUND(K25*0.625,2)","v":0},{"$nulls":4},{"$f":"IF(AND(G25+H25+L25>0,ISBLANK(A25)=TRUE),\"Enter Date\",IF(AND(G25+H25+L25>0,ISBLANK(D25)=TRUE),\"Select Program\",G25+H25+L25))","v":0}]
[]
[{"$nulls":6},{"$f":"E27*IF(Codes!$G$1=TRUE,14,9)+F27","v":0},{"$nulls":3},{"$f":"I28-I27","v":0},{"$f":"ROUND(K27*0.625,2)","v":0},{"$nulls":4},{"$f":"IF(AND(G27+H27+L27>0,ISBLANK(A27)=TRUE),\"Enter Date\",IF(AND(G27+H27+L27>0,ISBLANK(D27)=TRUE),\"Select Program\",G27+H27+L27))","v":0}]
[]
[{"$nulls":6},{"$f":"E29*IF(Codes!$G$1=TRUE,14,9)+F29","v":0},{"$nulls":3},{"$f":"I30-I29","v":0},{"$f":"ROUND(K29*0.625,2)","v":0},{"$nulls":4},{"$f":"IF(AND(G29+H29+L29>0,ISBLANK(A29)=TRUE),\"Enter Date\",IF(AND(G29+H29+L29>0,ISBLANK(D29)=TRUE),\"Select Program\",G29+H29+L29))","v":0}]
[]
{"$rows_left_out":15}
{"sheet":"Codes","index":3,"n_rows":74,"n_cols":8,"rows_kept":74,"hidden":true}
["Employee","Vendor #",{"$nulls":4},false,"*Allocate"]
[{"$nulls":7},"*Housing"]
[{"$nulls":7},"*Programs"]
["Ahart, Stephanie","10-AHAR00",{"$nulls":5},"1982 FOUN"]
["Allen, Jerry","00-ALLE13",{"$nulls":5},"BPL"]
["Austin, Matthew","10-AUST02",{"$nulls":5},"CHU"]
["Austin, Michael","10-AUST00",{"$nulls":5},"CLU"]
["Baldwin, Diane","00-BALD03",{"$nulls":5},"CRP - A"]
["Berry, Teresa","00-BERRY00",{"$nulls":5},"CRP - T"]
["Bishop, Whitney","10-BISH01",{"$nulls":5},"CYBD-2"]
["Blazek, Kimberly","10-BLAZ00",{"$nulls":5},"EFILP"]
["Bolyard, Tina","10-BOLY00",{"$nulls":5},"FHU"]
["Bowling, Richard","00-BOWL02",{"$nulls":5},"HRE"]
["Buchanan, Tina","00-BUCH00",{"$nulls":5},"HRE - CHR"]
["Carpenter, Jennifer","10-CARP01",{"$nulls":5},"HRE - CLK"]
["Cheslock, Jonathan","00-CHES00",{"$nulls":5},"HRE - HNT"]
["Clevenger, Heather","00-CLEV00",{"$nulls":5},"HRE - HSN"]
["Coleman, Trecie","00-COLE06",{"$nulls":5},"HRE - PKB"]
["Crouch, Daniel","10-CROU00",{"$nulls":5},"HRE - WPA"]
["Cunningham, Todd","00-CUNN10",{"$nulls":5},"HVU"]
["Davis, Caleb","06-DAVI08",{"$nulls":5},"LUA"]
["Davis, Kelly","10-DAVI01",{"$nulls":5},"MUA"]
["Ellis, Daniele","10-ELLE00",{"$nulls":5},"NDWG R2 2021"]
["Ellis, Ricky","10-ELLI01",{"$nulls":5},"NDWG R3 2021"]
["Gay, Billie J","00-GAYY00",{"$nulls":5},"R2 WBLS"]
["Grover, Chayden","00-GROV02",{"$nulls":5},"R3 Buss Serv"]
["Hamilton, Clayton","10-HAMI00",{"$nulls":5},"R3 One Stop"]
["Hendrix, Kelly","10-HEND01",{"$nulls":5},"R3Y OS"]
["Hicks, Jerry","00-HICK10",{"$nulls":5},"R3Y OS WE"]
["Hileman, Emily","00-HILE02",{"$nulls":5},"R3 SYP"]
{"$rows_left_out":44}